Reaction Details
TargetC-C chemokine receptor type 5
LigandBDBM50104929
Substrate/Competitorn/a
Meas. Tech.ChEMBL_49996 (CHEMBL661336)
Ki 25±n/a nM
Citation Palani, AShapiro, SJosien, HBara, TClader, JWGreenlee, WJCox, KStrizki, JMBaroudy, BM Synthesis, SAR, and biological evaluation of oximino-piperidino-piperidine amides. 1. Orally bioavailable CCR5 receptor antagonists with potent anti-HIV activity. J Med Chem45:3143-60 (2002) C-C chemokine receptor type 5
Name:C-C chemokine receptor type 5
Type:PROTEIN
Mol. Mass.:40803.93
Organism:Mus musculus
Description:ChEMBL_49996
Residue:354
BDBM50104929
NameBDBM50104929
Synonyms:(4-{(4-Bromo-phenyl)-[(E)-methoxyimino]-methyl}-4'-methyl-[1,4']bipiperidinyl-1'-yl)-(2,6-dimethyl-phenyl)-methanone (E/Z)-{4-[(4-Bromo-phenyl)-methoxyimino-methyl]-4'-methyl-[1,4']bipiperidinyl-1'-yl}-(2,6-dimethyl-phenyl)-methanone | CHEMBL112760
TypeSmall organic molecule
Emp. Form.C28H36BrN3O2
Mol. Mass.526.508
SMILESCO\N=C(/C1CCN(CC1)C1(C)CCN(CC1)C(=O)c1c(C)cccc1C)c1ccc(Br)cc1