Reaction Details
TargetBeta-lactamase
LigandBDBM50115618
Substrate/Competitorn/a
Meas. Tech.ChEMBL_35527 (CHEMBL649553)
Ki 20±n/a nM
Citation Powers, RAShoichet, BK Structure-based approach for binding site identification on AmpC beta-lactamase. J Med Chem45:3222-34 (2002) Beta-lactamase
Name:Beta-lactamase
Type:Protien
Mol. Mass.:41561.62
Organism:Escherichia coli
Description:P00811
Residue:377
BDBM50115618
NameBDBM50115618
Synonyms:2-[(2-Amino-thiazol-4-yl)-(dihydroxyboranylmethyl-carbamoyl)-methyleneaminooxy]-2-methyl-propionic acid | CHEMBL324887
TypeSmall organic molecule
Emp. Form.C10H14BN4O6S
Mol. Mass.329.118
SMILESCC(C)(O\N=C(\C(=O)NCB(O)O)c1csc(N)n1)C([O-])=O