Reaction Details
TargetThyroid hormone receptor beta
LigandBDBM18884
Substrate/Competitorn/a
Meas. Tech.ChEMBL_210501 (CHEMBL811896)
IC50 680±n/a nM
Citation Nguyen, NHApriletti, JWCunha Lima, STWebb, PBaxter, JDScanlan, TS Rational design and synthesis of a novel thyroid hormone antagonist that blocks coactivator recruitment. J Med Chem45:3310-20 (2002) Thyroid hormone receptor beta
Name:Thyroid hormone receptor beta
Type:Receptor
Mol. Mass.:52793.62
Organism:Homo sapiens (Human)
Description:Recombinant hThR was obtained from nuclear extracts from SF9 cells infected with baculovirus vectors encoding for ThRbeta 1.
Residue:461
BDBM18884
NameBDBM18884
Synonyms:2-(4-{[4-hydroxy-3-(4-nitrophenyl)-5-(propan-2-yl)phenyl]methyl}-3,5-dimethylphenoxy)acetic acid JMC496635 Compound 4 | thyromimetic, 5a
TypeSmall organic molecule
Emp. Form.C26H27NO6
Mol. Mass.449.4957
SMILESCC(C)c1cc(Cc2c(C)cc(OCC(O)=O)cc2C)cc(c1O)-c1ccc(cc1)[N+]([O-])=O