Reaction Details
TargetThyroid hormone receptor alpha
LigandBDBM18885
Substrate/Competitorn/a
Meas. Tech.ChEMBL_210491 (CHEMBL814598)
Kd 93±n/a nM
Citation Nguyen, NHApriletti, JWCunha Lima, STWebb, PBaxter, JDScanlan, TS Rational design and synthesis of a novel thyroid hormone antagonist that blocks coactivator recruitment. J Med Chem45:3310-20 (2002) Thyroid hormone receptor alpha
Name:Thyroid hormone receptor alpha
Type:Receptor
Mol. Mass.:54818.00
Organism:Homo sapiens (Human)
Description:Recombinant hThR was obtained from nuclear extracts from SF9 cells infected with baculovirus vectors encoding for ThRalpha 1.
Residue:490
BDBM18885
NameBDBM18885
Synonyms:2-[4-({4-hydroxy-3-[2-(4-nitrophenyl)ethynyl]-5-(propan-2-yl)phenyl}methyl)-3,5-dimethylphenoxy]acetic acid JMC496635 Compound 5 | thyromimetic, 5b
TypeSmall organic molecule
Emp. Form.C28H27NO6
Mol. Mass.473.5171
SMILESCC(C)c1cc(Cc2c(C)cc(OCC(O)=O)cc2C)cc(C#Cc2ccc(cc2)[N+]([O-])=O)c1O