Reaction Details
Target5-hydroxytryptamine receptor 2C
LigandBDBM50115831
Substrate/Competitorn/a
Meas. Tech.ChEBML_2832
Ki 0.900000±n/a nM
Citation Chambers, JJKurrasch-Orbaugh, DMNichols, DE Translocation of the 5-alkoxy substituent of 2,5-dialkoxyarylalkylamines to the 6-position: effects on 5-HT(2A/2C) receptor affinity. Bioorg Med Chem Lett12:1997-9 (2002) 5-hydroxytryptamine receptor 2C
Name:5-hydroxytryptamine receptor 2C
Type:Enzyme
Mol. Mass.:51935.10
Organism:Rattus norvegicus (Rat)
Description:P08909
Residue:460
BDBM50115831
NameBDBM50115831
Synonyms:1-Methyl-2-(4-methyl-benzo[1,2-b;5,4-b']difuran-8-yl)-ethylamine | CHEMBL304636
TypeSmall organic molecule
Emp. Form.C14H15NO2
Mol. Mass.229.2744
SMILESCC(N)Cc1c2occc2c(C)c2ccoc12