Reaction Details
TargetNeprilysin
LigandBDBM50115834
Substrate/Competitorn/a
Meas. Tech.ChEBML_144469
Ki 14±n/a nM
Citation Inguimbert, NPoras, HTeffo, FBeslot, FSelkti, MTomas, AScalbert, EBennejean, CRenard, PFournié-Zaluski, MCRoques, BP N-[2-(Indan-1-yl)-3-mercapto-propionyl] amino acids as highly potent inhibitors of the three vasopeptidases (NEP, ACE, ECE): In vitro and In vivo activities. Bioorg Med Chem Lett12:2001-5 (2002) Neprilysin
Name:Neprilysin
Type:Enzyme
Mol. Mass.:85570.75
Organism:Oryctolagus cuniculus (rabbit)
Description:NEP was purified to homogeneity from rabbit kidney.
Residue:750
BDBM50115834
NameBDBM50115834
Synonyms:3-(1H-Indol-3-yl)-2-[3-mercapto-2-(5-phenyl-indan-1-yl)-propionylamino]-propionic acid | CHEMBL61640
TypeSmall organic molecule
Emp. Form.C29H28N2O3S
Mol. Mass.484.609
SMILESOC(=O)C(Cc1c[nH]c2ccccc12)NC(=O)C(CS)C1CCc2cc(ccc12)-c1ccccc1