Reaction Details
TargetGonadotropin-releasing hormone receptor
LigandBDBM50115995
Substrate/Competitorn/a
Meas. Tech.ChEBML_97294
IC50 0.700000±n/a nM
Citation Sasaki, SImaeda, THayase, YShimizu, YKasai, SCho, NHarada, MSuzuki, NFuruya, SFujino, M A new class of potent nonpeptide luteinizing hormone-releasing hormone (LHRH) antagonists: design and synthesis of 2-phenylimidazo[1,2-a]pyrimidin-5-ones. Bioorg Med Chem Lett12:2073-7 (2002) Gonadotropin-releasing hormone receptor
Name:Gonadotropin-releasing hormone receptor
Type:Enzyme
Mol. Mass.:37749.45
Organism:Homo sapiens (Human)
Description:P30968
Residue:328
BDBM50115995
NameBDBM50115995
Synonyms:3-[(Benzyl-methyl-amino)-methyl]-8-(2,6-difluoro-benzyl)-2-[4-(3-methoxy-ureido)-phenyl]-5-oxo-5,8-dihydro-imidazo[1,2-a]pyrimidine-6-carboxylic acid ethyl ester | CHEMBL291896
TypeSmall organic molecule
Emp. Form.C33H32F2N6O5
Mol. Mass.630.6412
SMILESCCOC(=O)c1cn(Cc2c(F)cccc2F)c2nc(c(CN(C)Cc3ccccc3)n2c1=O)-c1ccc(NC(=O)NOC)cc1