Reaction Details
TargetMitogen-activated protein kinase 14
LigandBDBM50116024
Substrate/Competitorn/a
Meas. Tech.ChEBML_124498
IC50 800±n/a nM
Citation Revesz, LDi Padova, FEBuhl, TFeifel, RGram, HHiestand, PManning, UWolf, RZimmerlin, AG SAR of 2,6-diamino-3,5-difluoropyridinyl substituted heterocycles as novel p38MAP kinase inhibitors. Bioorg Med Chem Lett12:2109-12 (2002) Mitogen-activated protein kinase 14
Name:Mitogen-activated protein kinase 14
Type:Enzyme
Mol. Mass.:41281.22
Organism:Mus musculus (mouse)
Description:The full-length open reading frame of murine p38 alpha was cloned and expressed in E. coli.. Soluble murine p38R was extracted from cell pellets and purified using ion-exchange chromatography.
Residue:360
BDBM50116024
NameBDBM50116024
Synonyms:4-[4-(4-Fluoro-phenyl)-thiazol-5-yl]-pyridine | CHEMBL294052
TypeSmall organic molecule
Emp. Form.C14H9FN2S
Mol. Mass.256.298
SMILESFc1ccc(cc1)-c1ncsc1-c1ccncc1