Reaction Details
TargetMitogen-activated protein kinase 14
LigandBDBM50116032
Substrate/Competitorn/a
Meas. Tech.ChEBML_124498
IC50 400±n/a nM
Citation Revesz, LDi Padova, FEBuhl, TFeifel, RGram, HHiestand, PManning, UWolf, RZimmerlin, AG SAR of 2,6-diamino-3,5-difluoropyridinyl substituted heterocycles as novel p38MAP kinase inhibitors. Bioorg Med Chem Lett12:2109-12 (2002) Mitogen-activated protein kinase 14
Name:Mitogen-activated protein kinase 14
Type:Enzyme
Mol. Mass.:41281.22
Organism:Mus musculus (mouse)
Description:The full-length open reading frame of murine p38 alpha was cloned and expressed in E. coli.. Soluble murine p38R was extracted from cell pellets and purified using ion-exchange chromatography.
Residue:360
BDBM50116032
NameBDBM50116032
Synonyms:3,5-Difluoro-4-[4-(4-fluoro-phenyl)-5-pyridin-4-yl-oxazol-2-yl]-pyridine-2,6-diamine | CHEMBL307336
TypeSmall organic molecule
Emp. Form.C19H12F3N5O
Mol. Mass.383.3267
SMILESNc1nc(N)c(F)c(-c2nc(c(o2)-c2ccncc2)-c2ccc(F)cc2)c1F