Reaction Details
TargetGlutamate receptor ionotropic, kainate 2
LigandBDBM50116043
Substrate/Competitorn/a
Meas. Tech.ChEBML_72854
Ki 1200±n/a nM
Citation Lubisch, WBehl, BHenn, CHofmann, HPReeb, JRegner, FVierling, M Pyrrolylquinoxalinediones carrying a piperazine residue represent highly potent and selective ligands to the homomeric kainate receptor GluR5. Bioorg Med Chem Lett12:2113-6 (2002) Glutamate receptor ionotropic, kainate 2
Name:Glutamate receptor ionotropic, kainate 2
Type:Enzyme Catalytic Domain
Mol. Mass.:102592.78
Organism:Homo sapiens (Human)
Description:Q13002
Residue:908
BDBM50116043
NameBDBM50116043
Synonyms:3-(6-Nitro-2,3-dioxo-7-pyrrol-1-yl-3,4-dihydro-2H-quinoxalin-1-yl)-propionic acid | CHEMBL305534
TypeSmall organic molecule
Emp. Form.C15H12N4O6
Mol. Mass.344.279
SMILESOC(=O)CCn1c2cc(c(cc2[nH]c(=O)c1=O)[N+]([O-])=O)-n1cccc1