Reaction Details
TargetCorticotropin-releasing factor receptor 1
LigandBDBM50116095
Substrate/Competitorn/a
Meas. Tech.ChEBML_51124
Ki 2±n/a nM
Citation Yuan, JGulianello, MDe Lombaert, SBrodbeck, RKieltyka, AHodgetts, KJ 3-Aryl pyrazolo[4,3-d]pyrimidine derivatives: Nonpeptide CRF-1 antagonists. Bioorg Med Chem Lett12:2133-6 (2002) Corticotropin-releasing factor receptor 1
Name:Corticotropin-releasing factor receptor 1
Type:Enzyme
Mol. Mass.:50744.31
Organism:Homo sapiens (Human)
Description:P34998
Residue:444
BDBM50116095
NameBDBM50116095
Synonyms:CHEMBL293228 | [3-(2,4-Dichloro-phenyl)-2,5-dimethyl-2H-pyrazolo[4,3-d]pyrimidin-7-yl]-dipropyl-amine
TypeSmall organic molecule
Emp. Form.C19H23Cl2N5
Mol. Mass.392.325
SMILESCCCN(CCC)c1nc(C)nc2c(-c3ccc(Cl)cc3Cl)n(C)nc12