Reaction Details
TargetCorticotropin-releasing factor receptor 1
LigandBDBM50116118
Substrate/Competitorn/a
Meas. Tech.ChEBML_51124
Ki 3±n/a nM
Citation Yuan, JGulianello, MDe Lombaert, SBrodbeck, RKieltyka, AHodgetts, KJ 3-Aryl pyrazolo[4,3-d]pyrimidine derivatives: Nonpeptide CRF-1 antagonists. Bioorg Med Chem Lett12:2133-6 (2002) Corticotropin-releasing factor receptor 1
Name:Corticotropin-releasing factor receptor 1
Type:Enzyme
Mol. Mass.:50744.31
Organism:Homo sapiens (Human)
Description:P34998
Residue:444
BDBM50116118
NameBDBM50116118
Synonyms:CHEMBL304272 | [3-(2,4-Dichloro-phenyl)-2,5-dimethyl-2H-pyrazolo[4,3-d]pyrimidin-7-yl]-bis-(2-methoxy-ethyl)-amine
TypeSmall organic molecule
Emp. Form.C19H23Cl2N5O2
Mol. Mass.424.324
SMILESCOCCN(CCOC)c1nc(C)nc2c(-c3ccc(Cl)cc3Cl)n(C)nc12