Reaction Details
TargetAlpha-1B adrenergic receptor
LigandBDBM50116201
Substrate/Competitorn/a
Meas. Tech.ChEBML_34331
Ki 1063±n/a nM
Citation Khatuya, HPulito, VLJolliffe, LKLi, XMurray, WV Novel thiophene derivatives for the treatment of benign prostatic hyperplasia. Bioorg Med Chem Lett12:2145-8 (2002) Alpha-1B adrenergic receptor
Name:Alpha-1B adrenergic receptor
Type:Enzyme
Mol. Mass.:56862.13
Organism:Homo sapiens (Human)
Description:P35368
Residue:520
BDBM50116201
NameBDBM50116201
Synonyms:CHEMBL302495 | {5-[4-(2-Methoxy-phenyl)-piperazin-1-ylmethyl]-thiophen-2-yl}-methanol
TypeSmall organic molecule
Emp. Form.C17H22N2O2S
Mol. Mass.318.434
SMILESCOc1ccccc1N1CCN(Cc2ccc(CO)s2)CC1