Reaction Details
TargetAlpha-1B adrenergic receptor
LigandBDBM50116206
Substrate/Competitorn/a
Meas. Tech.ChEBML_34331
Ki 592±n/a nM
Citation Khatuya, HPulito, VLJolliffe, LKLi, XMurray, WV Novel thiophene derivatives for the treatment of benign prostatic hyperplasia. Bioorg Med Chem Lett12:2145-8 (2002) Alpha-1B adrenergic receptor
Name:Alpha-1B adrenergic receptor
Type:Enzyme
Mol. Mass.:56862.13
Organism:Homo sapiens (Human)
Description:P35368
Residue:520
BDBM50116206
NameBDBM50116206
Synonyms:(S)-1-{5-[4-(2-Methoxy-phenyl)-piperazin-1-ylmethyl]-thiophen-2-ylmethyl}-pyrrolidine-2-carboxylic acid methyl ester | CHEMBL68241
TypeSmall organic molecule
Emp. Form.C23H31N3O3S
Mol. Mass.429.576
SMILESCOC(=O)[C@@H]1CCCN1Cc1ccc(CN2CCN(CC2)c2ccccc2OC)s1