Reaction Details
TargetAlpha-1B adrenergic receptor
LigandBDBM50116204
Substrate/Competitorn/a
Meas. Tech.ChEBML_34331
Ki 384±n/a nM
Citation Khatuya, HPulito, VLJolliffe, LKLi, XMurray, WV Novel thiophene derivatives for the treatment of benign prostatic hyperplasia. Bioorg Med Chem Lett12:2145-8 (2002) Alpha-1B adrenergic receptor
Name:Alpha-1B adrenergic receptor
Type:Enzyme
Mol. Mass.:56862.13
Organism:Homo sapiens (Human)
Description:P35368
Residue:520
BDBM50116204
NameBDBM50116204
Synonyms:1-{5-[4-(2-Propoxy-phenyl)-piperazin-1-ylmethyl]-thiophen-3-ylmethyl}-piperidin-2-one | CHEMBL67713
TypeSmall organic molecule
Emp. Form.C24H33N3O2S
Mol. Mass.427.603
SMILESCC(C)Oc1ccccc1N1CCN(Cc2cc(CN3CCCCC3=O)cs2)CC1