Reaction Details
TargetAlpha-1D adrenergic receptor
LigandBDBM50116208
Substrate/Competitorn/a
Meas. Tech.ChEBML_32433
Ki 25±n/a nM
Citation Khatuya, HPulito, VLJolliffe, LKLi, XMurray, WV Novel thiophene derivatives for the treatment of benign prostatic hyperplasia. Bioorg Med Chem Lett12:2145-8 (2002) Alpha-1D adrenergic receptor
Name:Alpha-1D adrenergic receptor
Type:Enzyme Catalytic Domain
Mol. Mass.:60485.82
Organism:Homo sapiens (Human)
Description:adrenergic Alpha1D ADRA1D HUMAN::P25100
Residue:572
BDBM50116208
NameBDBM50116208
Synonyms:1-{5-[4-(2-Propoxy-phenyl)-piperazin-1-ylmethyl]-thiophen-3-ylmethyl}-pyrrolidin-2-one | CHEMBL69848
TypeSmall organic molecule
Emp. Form.C23H31N3O2S
Mol. Mass.413.576
SMILESCC(C)Oc1ccccc1N1CCN(Cc2cc(CN3CCCC3=O)cs2)CC1