Reaction Details
TargetAlpha-1D adrenergic receptor
LigandBDBM50116205
Substrate/Competitorn/a
Meas. Tech.ChEBML_32433
Ki 92±n/a nM
Citation Khatuya, HPulito, VLJolliffe, LKLi, XMurray, WV Novel thiophene derivatives for the treatment of benign prostatic hyperplasia. Bioorg Med Chem Lett12:2145-8 (2002) Alpha-1D adrenergic receptor
Name:Alpha-1D adrenergic receptor
Type:Enzyme Catalytic Domain
Mol. Mass.:60485.82
Organism:Homo sapiens (Human)
Description:adrenergic Alpha1D ADRA1D HUMAN::P25100
Residue:572
BDBM50116205
NameBDBM50116205
Synonyms:1-(5-Bromo-thiophen-2-ylmethyl)-4-(2-methoxy-phenyl)-piperazine | CHEMBL67932
TypeSmall organic molecule
Emp. Form.C16H19BrN2OS
Mol. Mass.367.304
SMILESCOc1ccccc1N1CCN(Cc2ccc(Br)s2)CC1