Reaction Details
TargetGranzyme B
LigandBDBM50116259
Substrate/Competitorn/a
Meas. Tech.ChEBML_72172
Ki 80±n/a nM
Citation Willoughby, CABull, HGGarcia-Calvo, MJiang, JChapman, KTThornberry, NA Discovery of potent, selective human granzyme B inhibitors that inhibit CTL mediated apoptosis. Bioorg Med Chem Lett12:2197-200 (2002) Granzyme B
Name:Granzyme B
Type:PROTEIN
Mol. Mass.:27735.56
Organism:Homo sapiens (Human)
Description:ChEMBL_469245
Residue:247
BDBM50116259
NameBDBM50116259
Synonyms:(S)-4-((3S,4S)-2-Acetylamino-3-methyl-pentanoylamino)-5-[2-((S)-(S)-2-carboxy-1-formyl-ethylcarbamoyl)-pyrrolidin-1-yl]-5-oxo-pentanoic acid | CHEMBL70602
TypeSmall organic molecule
Emp. Form.C22H34N4O9
Mol. Mass.498.5268
SMILESCC[C@H](C)[C@H](NC(C)=O)C(=O)N[C@@H](CCC(O)=O)C(=O)N1CCC[C@H]1C(=O)N[C@@H](CC(O)=O)C=O