Reaction Details
TargetGranzyme B
LigandBDBM50116266
Substrate/Competitorn/a
Meas. Tech.ChEBML_72172
Ki 2300±n/a nM
Citation Willoughby, CABull, HGGarcia-Calvo, MJiang, JChapman, KTThornberry, NA Discovery of potent, selective human granzyme B inhibitors that inhibit CTL mediated apoptosis. Bioorg Med Chem Lett12:2197-200 (2002) Granzyme B
Name:Granzyme B
Type:PROTEIN
Mol. Mass.:27735.56
Organism:Homo sapiens (Human)
Description:ChEMBL_469245
Residue:247
BDBM50116266
NameBDBM50116266
Synonyms:(S)-3-({(S)-(S)-5-[(S)-2-((S)-Acetyl-methyl-amino)-3-methyl-pentanoylamino]-4-oxo-1,2,4,5,6,7-hexahydro-azepino[3,2,1-hi]indole-2-carbonyl}-amino)-5-(4-fluoro-benzylsulfanyl)-4-oxo-pentanoic acid | CHEMBL68970
TypeSmall organic molecule
Emp. Form.C34H41FN4O7S
Mol. Mass.668.775
SMILESCC[C@H](C)[C@H](N(C)C(C)=O)C(=O)N[C@H]1CCc2cccc3C[C@H](N(c23)C1=O)C(=O)N[C@@H](CC(O)=O)C(=O)CSCc1ccc(F)cc1