Reaction Details
TargetGranzyme B
LigandBDBM50116265
Substrate/Competitorn/a
Meas. Tech.ChEBML_72172
Ki 85±n/a nM
Citation Willoughby, CABull, HGGarcia-Calvo, MJiang, JChapman, KTThornberry, NA Discovery of potent, selective human granzyme B inhibitors that inhibit CTL mediated apoptosis. Bioorg Med Chem Lett12:2197-200 (2002) Granzyme B
Name:Granzyme B
Type:PROTEIN
Mol. Mass.:27735.56
Organism:Homo sapiens (Human)
Description:ChEMBL_469245
Residue:247
BDBM50116265
NameBDBM50116265
Synonyms:(S)-3-({(S)-(S)-5-[(S)-2-((S)-Acetyl-methyl-amino)-3-methyl-pentanoylamino]-4-oxo-1,2,4,5,6,7-hexahydro-azepino[3,2,1-hi]indole-2-carbonyl}-amino)-4-benzothiazol-2-yl-4-oxo-butyric acid | CHEMBL69027
TypeSmall organic molecule
Emp. Form.C33H37N5O7S
Mol. Mass.647.741
SMILESCC[C@H](C)[C@H](N(C)C(C)=O)C(=O)N[C@H]1CCc2cccc3C[C@H](N(c23)C1=O)C(=O)N[C@@H](CC(O)=O)C(=O)c1nc2ccccc2s1