Reaction Details
TargetIntegrin alpha-4/beta-7
LigandBDBM50116289
Substrate/Competitorn/a
Meas. Tech.ChEMBL_32534 (CHEMBL646568)
IC50 2.5±n/a nM
Citation Kamenecka, TMLanza, Tde Laszlo, SELi, BMcCauley, EDVan Riper, GEgger, LAKidambi, UMumford, RATong, SMacCoss, MSchmidt, JAHagmann, WK N-aryl-prolyl-dipeptides as potent antagonists of VLA-4. Bioorg Med Chem Lett12:2205-8 (2002) Integrin alpha-4/beta-7
Name:Integrin alpha-4/beta-7
Type:Protein Complex
Mol. Mass.:n/a
Description:The assay uses stably transfected K562 cells expressing human alpha4beta7 integrin.
Components:This complex has 2 components.
Component 1
Name:Integrin alpha-4
Synonyms:CD49 antigen-like family member D CD49d antigen ITA4_HUMAN Integrin alpha-4 Integrin alpha-IV VLA-4 integrin alpha 4 precursor | integrin alpha-4 precursor
Type:Membrane Protein
Mol. Mass.:114897.35
Organism:Homo sapiens (Human)
Description:P13612
Residue:1032
Component 2
Name:Integrin beta-7
Synonyms:ITB7_HUMAN Integrin alpha-4/beta-7 Integrin beta7
Type:Membrane Protein
Mol. Mass.:86893.88
Organism:Homo sapiens (Human)
Description:P26010
Residue:798
BDBM50116289
NameBDBM50116289
Synonyms:2-[(1-Benzenesulfonyl-pyrrolidine-2-carbonyl)-amino]-3-(2',6'-dimethoxy-biphenyl-4-yl)-propionic acid | CHEMBL69035
TypeSmall organic molecule
Emp. Form.C28H30N2O7S
Mol. Mass.538.612
SMILESCOc1cccc(OC)c1-c1ccc(CC(NC(=O)C2CCCN2S(=O)(=O)c2ccccc2)C(O)=O)cc1