Reaction Details
TargetAdenosine receptor A3
LigandBDBM50116371
Substrate/Competitorn/a
Meas. Tech.ChEMBL_31694 (CHEMBL876574)
Ki 5±n/a nM
Citation Priego, EMvon Frijtag Drabbe Kuenzel, JIJzerman, APCamarasa, MJPérez-Pérez, MJ Pyrido[2,1-f]purine-2,4-dione derivatives as a novel class of highly potent human A(3) adenosine receptor antagonists. J Med Chem45:3337-44 (2002) Adenosine receptor A3
Name:Adenosine receptor A3
Type:G Protein-Coupled Receptor (GPCR)
Mol. Mass.:36197.32
Organism:Homo sapiens (Human)
Description:P0DMS8
Residue:318
BDBM50116371
NameBDBM50116371
Synonyms:3-Allyl-1-benzyl-1H-1,3,4b,9-tetraaza-fluorene-2,4-dione | CHEMBL114832
TypeSmall organic molecule
Emp. Form.C19H16N4O2
Mol. Mass.332.3559
SMILESC=CCn1c(=O)n(Cc2ccccc2)c2nc3ccccn3c2c1=O