Reaction Details
TargetAdenosine receptor A3
LigandBDBM50116382
Substrate/Competitorn/a
Meas. Tech.ChEMBL_31694 (CHEMBL876574)
Ki 6.3±n/a nM
Citation Priego, EMvon Frijtag Drabbe Kuenzel, JIJzerman, APCamarasa, MJPérez-Pérez, MJ Pyrido[2,1-f]purine-2,4-dione derivatives as a novel class of highly potent human A(3) adenosine receptor antagonists. J Med Chem45:3337-44 (2002) Adenosine receptor A3
Name:Adenosine receptor A3
Type:G Protein-Coupled Receptor (GPCR)
Mol. Mass.:36197.32
Organism:Homo sapiens (Human)
Description:P0DMS8
Residue:318
BDBM50116382
NameBDBM50116382
Synonyms:1-Benzyl-3-isobutyl-1H-1,3,4b,9-tetraaza-fluorene-2,4-dione | CHEMBL323717
TypeSmall organic molecule
Emp. Form.C20H20N4O2
Mol. Mass.348.3984
SMILESCC(C)Cn1c(=O)n(Cc2ccccc2)c2nc3ccccn3c2c1=O