Reaction Details
TargetTyrosine-protein kinase Lck
LigandBDBM50116398
Substrate/Competitorn/a
Meas. Tech.ChEMBL_221318 (CHEMBL841208)
IC50 380±n/a nM
Citation Snow, RJCardozo, MGMorwick, TMBusacca, CADong, YEckner, RJJacober, SJakes, SKapadia, SLukas, SPanzenbeck, MPeet, GWPeterson, JDProkopowicz, ASSellati, RTolbert, RMTschantz, MAMoss, N Discovery of 2-phenylamino-imidazo[4,5-h]isoquinolin-9-ones: a new class of inhibitors of lck kinase. J Med Chem45:3394-405 (2002) Tyrosine-protein kinase Lck
Name:Tyrosine-protein kinase Lck
Type:n/a
Mol. Mass.:57987.83
Organism:Homo sapiens (Human)
Description:P06239
Residue:509
BDBM50116398
NameBDBM50116398
Synonyms:2-(2,6-Dichloro-phenylamino)-1,6,7,8-tetrahydro-imidazo[4,5-h]isoquinolin-9-one | CHEMBL325282
TypeSmall organic molecule
Emp. Form.C16H12Cl2N4O
Mol. Mass.347.199
SMILESClc1cccc(Cl)c1Nc1nc2ccc3CCNC(=O)c3c2[nH]1