Reaction Details
TargetTyrosine-protein kinase Lck
LigandBDBM50116406
Substrate/Competitorn/a
Meas. Tech.ChEMBL_221318 (CHEMBL841208)
IC50 730±n/a nM
Citation Snow, RJCardozo, MGMorwick, TMBusacca, CADong, YEckner, RJJacober, SJakes, SKapadia, SLukas, SPanzenbeck, MPeet, GWPeterson, JDProkopowicz, ASSellati, RTolbert, RMTschantz, MAMoss, N Discovery of 2-phenylamino-imidazo[4,5-h]isoquinolin-9-ones: a new class of inhibitors of lck kinase. J Med Chem45:3394-405 (2002) Tyrosine-protein kinase Lck
Name:Tyrosine-protein kinase Lck
Type:n/a
Mol. Mass.:57987.83
Organism:Homo sapiens (Human)
Description:P06239
Residue:509
BDBM50116406
NameBDBM50116406
Synonyms:6,6-Dimethyl-2-(2,4,6-trichloro-phenylamino)-1,6-dihydro-imidazo[4,5-h]isoquinoline-7,9-dione | CHEMBL324056
TypeSmall organic molecule
Emp. Form.C18H13Cl3N4O2
Mol. Mass.423.68
SMILESCC1(C)C(=O)NC(=O)c2c1ccc1nc(Nc3c(Cl)cc(Cl)cc3Cl)[nH]c21