Reaction Details
TargetTyrosine-protein kinase Lck
LigandBDBM50116399
Substrate/Competitorn/a
Meas. Tech.ChEMBL_221318 (CHEMBL841208)
IC50 27±n/a nM
Citation Snow, RJCardozo, MGMorwick, TMBusacca, CADong, YEckner, RJJacober, SJakes, SKapadia, SLukas, SPanzenbeck, MPeet, GWPeterson, JDProkopowicz, ASSellati, RTolbert, RMTschantz, MAMoss, N Discovery of 2-phenylamino-imidazo[4,5-h]isoquinolin-9-ones: a new class of inhibitors of lck kinase. J Med Chem45:3394-405 (2002) Tyrosine-protein kinase Lck
Name:Tyrosine-protein kinase Lck
Type:n/a
Mol. Mass.:57987.83
Organism:Homo sapiens (Human)
Description:P06239
Residue:509
BDBM50116399
NameBDBM50116399
Synonyms:2-(2-Chloro-6-methyl-phenylamino)-6,7-dimethyl-1,8-dihydro-imidazo[4,5-h]isoquinolin-9-one | CHEMBL117267
TypeSmall organic molecule
Emp. Form.C19H17ClN4O
Mol. Mass.352.817
SMILESCc1cccc(Cl)c1Nc1nc2c(ccc3c(C)c(C)[nH]c(=O)c23)[nH]1