Reaction Details
TargetNeuropeptide Y receptor type 5
LigandBDBM50116608
Substrate/Competitorn/a
Meas. Tech.ChEMBL_143678 (CHEMBL755166)
IC50 8±n/a nM
Citation Block, MHBoyer, SBrailsford, WBrittain, DRCarroll, DChapman, SClarke, DSDonald, CSFoote, KMGodfrey, LLadner, AMarsham, PRMasters, DJMee, CDO'Donovan, MRPease, JEPickup, AGRayner, JWRoberts, ASchofield, PSuleman, ATurnbull, AV Discovery and optimization of a series of carbazole ureas as NPY5 antagonists for the treatment of obesity. J Med Chem45:3509-23 (2002) Neuropeptide Y receptor type 5
Name:Neuropeptide Y receptor type 5
Type:Enzyme
Mol. Mass.:50746.64
Organism:Homo sapiens (Human)
Description:Q15761
Residue:445
BDBM50116608
NameBDBM50116608
Synonyms:CHEMBL117922 | N-(9-Dimethylsulfamoyl-9H-carbazol-3-yl)-3-pyridin-4-yl-propionamide
TypeSmall organic molecule
Emp. Form.C22H22N4O3S
Mol. Mass.422.5
SMILESCN(C)S(=O)(=O)n1c2ccccc2c2cc(NC(=O)CCc3ccncc3)ccc12