Reaction Details
TargetNeuropeptide Y receptor type 5
LigandBDBM50116600
Substrate/Competitorn/a
Meas. Tech.ChEMBL_143682 (CHEMBL756249)
IC50 7±n/a nM
Citation Block, MHBoyer, SBrailsford, WBrittain, DRCarroll, DChapman, SClarke, DSDonald, CSFoote, KMGodfrey, LLadner, AMarsham, PRMasters, DJMee, CDO'Donovan, MRPease, JEPickup, AGRayner, JWRoberts, ASchofield, PSuleman, ATurnbull, AV Discovery and optimization of a series of carbazole ureas as NPY5 antagonists for the treatment of obesity. J Med Chem45:3509-23 (2002) Neuropeptide Y receptor type 5
Name:Neuropeptide Y receptor type 5
Type:Enzyme Catalytic Domain
Mol. Mass.:50435.58
Organism:Rat 6B
Description:NPY-Y5 NPY5R Rat 6B::Q63634
Residue:445
BDBM50116600
NameBDBM50116600
Synonyms:CHEMBL325475 | N-(9-Ethyl-9H-carbazol-3-yl)-3-pyridin-4-yl-propionamide
TypeSmall organic molecule
Emp. Form.C22H21N3O
Mol. Mass.343.4216
SMILESCCn1c2ccccc2c2cc(NC(=O)CCc3ccncc3)ccc12