Reaction Details
TargetNeuropeptide Y receptor type 5
LigandBDBM50116618
Substrate/Competitorn/a
Meas. Tech.ChEMBL_143678 (CHEMBL755166)
IC50 40±n/a nM
Citation Block, MHBoyer, SBrailsford, WBrittain, DRCarroll, DChapman, SClarke, DSDonald, CSFoote, KMGodfrey, LLadner, AMarsham, PRMasters, DJMee, CDO'Donovan, MRPease, JEPickup, AGRayner, JWRoberts, ASchofield, PSuleman, ATurnbull, AV Discovery and optimization of a series of carbazole ureas as NPY5 antagonists for the treatment of obesity. J Med Chem45:3509-23 (2002) Neuropeptide Y receptor type 5
Name:Neuropeptide Y receptor type 5
Type:Enzyme
Mol. Mass.:50746.64
Organism:Homo sapiens (Human)
Description:Q15761
Residue:445
BDBM50116618
NameBDBM50116618
Synonyms:CHEMBL324028 | Morpholine-4-carboxylic acid [9-(tetrahydro-furan-3-yl)-9H-carbazol-3-yl]-amide
TypeSmall organic molecule
Emp. Form.C21H23N3O3
Mol. Mass.365.4256
SMILESO=C(Nc1ccc2n(C3CCOC3)c3ccccc3c2c1)N1CCOCC1