Reaction Details
TargetNeuromedin-K receptor
LigandBDBM50116736
Substrate/Competitorn/a
Meas. Tech.ChEBML_209564
Ki 0.300000±n/a nM
Citation Reichard, GAGrice, CAShih, NYSpitler, JMajmundar, SWang, SDPaliwal, SAnthes, JCPiwinski, JJ Preparation of oxime dual NK(1)/NK(2) antagonists with reduced NK(3) affinity. Bioorg Med Chem Lett12:2355-8 (2002) Neuromedin-K receptor
Name:Neuromedin-K receptor
Type:Enzyme
Mol. Mass.:52221.96
Organism:Homo sapiens (Human)
Description:P29371
Residue:465
BDBM50116736
NameBDBM50116736
Synonyms:CHEMBL74956 | N-{(R)-5-{4-[3-(1-Carbamoyl-1-methyl-ethyl)-2-oxo-tetrahydro-pyrimidin-1-yl]-piperidin-1-yl}-3-(3,4-dichloro-phenyl)-2-[(Z)-methoxyimino]-pentyl}-3,5-dichloro-N-methyl-benzamide
TypeSmall organic molecule
Emp. Form.C33H42Cl4N6O4
Mol. Mass.728.536
SMILESCO\N=C(/CN(C)C(=O)c1cc(Cl)cc(Cl)c1)[C@H](CCN1CCC(CC1)N1CCCN(C1=O)C(C)(C)C(N)=O)c1ccc(Cl)c(Cl)c1