Reaction Details
TargetSubstance-K receptor
LigandBDBM50116715
Substrate/Competitorn/a
Meas. Tech.ChEBML_209036
Ki 0.800000±n/a nM
Citation Reichard, GAGrice, CAShih, NYSpitler, JMajmundar, SWang, SDPaliwal, SAnthes, JCPiwinski, JJ Preparation of oxime dual NK(1)/NK(2) antagonists with reduced NK(3) affinity. Bioorg Med Chem Lett12:2355-8 (2002) Substance-K receptor
Name:Substance-K receptor
Type:Protein
Mol. Mass.:44455.78
Organism:Homo sapiens (Human)
Description:P21452
Residue:398
BDBM50116715
NameBDBM50116715
Synonyms:3,5-Dichloro-N-{(R)-3-(3,4-dichloro-phenyl)-5-{4-[3-(N-hydroxycarbamimidoylmethyl)-2-oxo-tetrahydro-pyrimidin-1-yl]-piperidin-1-yl}-2-[(Z)-methoxyimino]-pentyl}-N-methyl-benzamide | CHEMBL404599
TypeSmall organic molecule
Emp. Form.C31H39Cl4N7O4
Mol. Mass.715.498
SMILESCO\N=C(/CN(C)C(=O)c1cc(Cl)cc(Cl)c1)[C@H](CCN1CCC(CC1)N1CCCN(CC(=N)NO)C1=O)c1ccc(Cl)c(Cl)c1