Reaction Details
TargetSubstance-P receptor
LigandBDBM50116739
Substrate/Competitorn/a
Meas. Tech.ChEBML_205873
Ki 1±n/a nM
Citation Reichard, GAGrice, CAShih, NYSpitler, JMajmundar, SWang, SDPaliwal, SAnthes, JCPiwinski, JJ Preparation of oxime dual NK(1)/NK(2) antagonists with reduced NK(3) affinity. Bioorg Med Chem Lett12:2355-8 (2002) Substance-P receptor
Name:Substance-P receptor
Type:G Protein-Coupled Receptor (GPCR)
Mol. Mass.:46254.43
Organism:Homo sapiens (Human)
Description:P25103
Residue:407
BDBM50116739
NameBDBM50116739
Synonyms:3,5-Dichloro-N-{(R)-3-(3,4-dichloro-phenyl)-5-[4-(3-hydroxy-2-oxo-tetrahydro-pyrimidin-1-yl)-piperidin-1-yl]-2-[(Z)-methoxyimino]-pentyl}-N-methyl-benzamide | CHEMBL78132
TypeSmall organic molecule
Emp. Form.C29H35Cl4N5O4
Mol. Mass.659.431
SMILESCO\N=C(/CN(C)C(=O)c1cc(Cl)cc(Cl)c1)[C@H](CCN1CCC(CC1)N1CCCN(O)C1=O)c1ccc(Cl)c(Cl)c1