Reaction Details
TargetNeuromedin-K receptor
LigandBDBM50116727
Substrate/Competitorn/a
Meas. Tech.ChEBML_209564
Ki 0.500000±n/a nM
Citation Reichard, GAGrice, CAShih, NYSpitler, JMajmundar, SWang, SDPaliwal, SAnthes, JCPiwinski, JJ Preparation of oxime dual NK(1)/NK(2) antagonists with reduced NK(3) affinity. Bioorg Med Chem Lett12:2355-8 (2002) Neuromedin-K receptor
Name:Neuromedin-K receptor
Type:Enzyme
Mol. Mass.:52221.96
Organism:Homo sapiens (Human)
Description:P29371
Residue:465
BDBM50116727
NameBDBM50116727
Synonyms:3,5-Dichloro-N-{(R)-3-(3,4-dichloro-phenyl)-5-{4-[3-(2-hydroxy-2-methyl-propyl)-2-oxo-tetrahydro-pyrimidin-1-yl]-piperidin-1-yl}-2-[(Z)-methoxyimino]-pentyl}-N-methyl-benzamide | CHEMBL310273
TypeSmall organic molecule
Emp. Form.C33H43Cl4N5O4
Mol. Mass.715.538
SMILESCO\N=C(/CN(C)C(=O)c1cc(Cl)cc(Cl)c1)[C@H](CCN1CCC(CC1)N1CCCN(CC(C)(C)O)C1=O)c1ccc(Cl)c(Cl)c1