Reaction Details
TargetCannabinoid receptor 2
LigandBDBM50451437
Substrate/Competitorn/a
Meas. Tech.ChEMBL_47134 (CHEMBL653699)
Ki 505±n/a nM
Citation Hynes, JLeftheris, KWu, HPandit, CChen, PNorris, DJChen, BCZhao, RKiener, PAChen, XTurk, LAPatil-Koota, VGillooly, KMShuster, DJMcIntyre, KW C-3 Amido-indole cannabinoid receptor modulators. Bioorg Med Chem Lett12:2399-402 (2002) Cannabinoid receptor 2
Name:Cannabinoid receptor 2
Type:G Protein-Coupled Receptor (GPCR)
Mol. Mass.:39690.94
Organism:Homo sapiens (Human)
Description:P34972
Residue:360
BDBM50451437
NameBDBM50451437
Synonyms:CHEMBL2112288
TypeSmall organic molecule
Emp. Form.C25H37N3O2
Mol. Mass.411.5802
SMILES[H][C@@]12CC[C@@](C)(C1)C(NC(=O)c1c(C)n(CCN(C)C)c3c(OC)cccc13)C2(C)C