Reaction Details
TargetGag-Pol polyprotein [489-587]
LigandBDBM50116915
Substrate/Competitorn/a
Meas. Tech.ChEBML_79956
IC50 0.230000±n/a nM
Citation Cheng, YZhang, FRano, TALu, ZSchleif, WAGabryelski, LOlsen, DBStahlhut, MRutkowski, CALin, JHJin, LEmini, EAChapman, KTTata, JR Indinavir analogues with blocked metabolism sites as HIV protease inhibitors with improved pharmacological profiles and high potency against PI-resistant viral strains. Bioorg Med Chem Lett12:2419-22 (2002) Gag-Pol polyprotein [489-587]
Name:Gag-Pol polyprotein [489-587]
Type:Enzyme Subunit
Mol. Mass.:10781.16
Organism:Human immunodeficiency virus type 1
Description:P04585[489-587]
Residue:99
BDBM50116915
NameBDBM50116915
Synonyms:(S)-4-Furo[3,2-c]pyridin-2-ylmethyl-1-[(2S,4R)-2-hydroxy-4-((1S,2R)-2-hydroxy-indan-1-ylcarbamoyl)-5-phenyl-pentyl]-piperazine-2-carboxylic acid tert-butylamide | CHEMBL81840
TypeSmall organic molecule
Emp. Form.C38H47N5O5
Mol. Mass.653.8103
SMILESCC(C)(C)NC(=O)[C@@H]1CN(Cc2cc3cnccc3o2)CCN1C[C@@H](O)C[C@@H](Cc1ccccc1)C(=O)N[C@@H]1[C@H](O)Cc2ccccc12