Reaction Details
TargetCytochrome P450 3A4
LigandBDBM517
Substrate/Competitorn/a
Meas. Tech.ChEMBL_151523 (CHEMBL760334)
IC50 150±n/a nM
Citation Duffy, JLKevin, NJKirk, BAChapman, KTSchleif, WAOlsen, DBStahlhut, MRutkowski, CAKuo, LCJin, LLin, JHEmini, EATata, JR Synthesis and activity of novel HIV protease inhibitors with improved potency against multiple PI-resistant viral strains. Bioorg Med Chem Lett12:2423-6 (2002) Cytochrome P450 3A4
Name:Cytochrome P450 3A4
Type:Enzyme
Mol. Mass.:57349.57
Organism:Homo sapiens (Human)
Description:n/a
Residue:503
BDBM517
NameBDBM517
Synonyms:(2S)-1-[(2S,4R)-4-benzyl-2-hydroxy-4-{[(1S,2R)-2-hydroxy-2,3-dihydro-1H-inden-1-yl]carbamoyl}butyl]-N-tert-butyl-4-(pyridin-3-ylmethyl)piperazine-2-carboxamide Crixivan Indinavir L-735, 524 | MK639
TypeSmall organic molecule
Emp. Form.C36H47N5O4
Mol. Mass.613.7895
SMILESCC(C)(C)NC(=O)[C@@H]1CN(Cc2cccnc2)CCN1C[C@@H](O)C[C@@H](Cc1ccccc1)C(=O)N[C@@H]1[C@H](O)Cc2ccccc12