Reaction Details
TargetAlpha-1D adrenergic receptor
LigandBDBM50116930
Substrate/Competitorn/a
Meas. Tech.ChEBML_32447
Ki 3064±n/a nM
Citation Khatuya, HHutchings, RHKuo, GHPulito, VLJolliffe, LKLi, XMurray, WV Arylpiperazine substituted heterocycles as selective alpha(1a) adrenergic antagonists. Bioorg Med Chem Lett12:2443-6 (2002) Alpha-1D adrenergic receptor
Name:Alpha-1D adrenergic receptor
Type:Enzyme Catalytic Domain
Mol. Mass.:60485.82
Organism:Homo sapiens (Human)
Description:adrenergic Alpha1D ADRA1D HUMAN::P25100
Residue:572
BDBM50116930
NameBDBM50116930
Synonyms:CHEMBL80125 | {5-[4-(2-Phenoxy-phenyl)-piperazin-1-ylmethyl]-isoxazol-3-yl}-methanol
TypeSmall organic molecule
Emp. Form.C21H23N3O3
Mol. Mass.365.4256
SMILESOCc1cc(CN2CCN(CC2)c2ccccc2Oc2ccccc2)on1