Reaction Details
TargetAlpha-1B adrenergic receptor
LigandBDBM50116938
Substrate/Competitorn/a
Meas. Tech.ChEBML_34347
Ki 2205±n/a nM
Citation Khatuya, HHutchings, RHKuo, GHPulito, VLJolliffe, LKLi, XMurray, WV Arylpiperazine substituted heterocycles as selective alpha(1a) adrenergic antagonists. Bioorg Med Chem Lett12:2443-6 (2002) Alpha-1B adrenergic receptor
Name:Alpha-1B adrenergic receptor
Type:Enzyme
Mol. Mass.:56862.13
Organism:Homo sapiens (Human)
Description:P35368
Residue:520
BDBM50116938
NameBDBM50116938
Synonyms:1-{5-[4-(2-Phenoxy-phenyl)-piperazin-1-ylmethyl]-isoxazol-3-ylmethyl}-piperidin-2-one | CHEMBL81661
TypeSmall organic molecule
Emp. Form.C26H30N4O3
Mol. Mass.446.5414
SMILESO=C1CCCCN1Cc1cc(CN2CCN(CC2)c2ccccc2Oc2ccccc2)on1