Reaction Details
TargetMycothiol S-conjugate amidase
LigandBDBM50117085
Substrate/Competitorn/a
Meas. Tech.ChEBML_140808
IC50 450000±n/a nM
Citation Nicholas, GMEckman, LLRay, SHughes, ROPfefferkorn, JABarluenga, SNicolaou, KCBewley, CA Bromotyrosine-derived natural and synthetic products as inhibitors of mycothiol-S-conjugate amidase. Bioorg Med Chem Lett12:2487-90 (2002) Mycothiol S-conjugate amidase
Name:Mycothiol S-conjugate amidase
Type:PROTEIN
Mol. Mass.:32719.79
Organism:Mycobacterium tuberculosis
Description:ChEMBL_626858
Residue:288
BDBM50117085
NameBDBM50117085
Synonyms:CHEMBL81748 | N-[2-(4-Amino-phenyldisulfanyl)-ethyl]-3-(3,5-difluoro-phenyl)-2-[(Z)-hydroxyimino]-propionamide
TypeSmall organic molecule
Emp. Form.C17H17F2N3O2S2
Mol. Mass.397.463
SMILESNc1ccc(SSCCNC(=O)C(Cc2cc(F)cc(F)c2)N=O)cc1