Reaction Details
Target5-hydroxytryptamine receptor 1A
LigandBDBM50117139
Substrate/Competitorn/a
Meas. Tech.ChEMBL_1316 (CHEMBL616693)
Ki 351.0±n/a nM
Citation Betti, LBotta, MCorelli, FFloridi, MGiannaccini, GMaccari, LManetti, FStrappaghetti, GTafi, ACorsano, S Alpha(1)-adrenoceptor antagonists. 4. Pharmacophore-based design, synthesis, and biological evaluation of new imidazo-, benzimidazo-, and indoloarylpiperazine derivatives. J Med Chem45:3603-11 (2002) 5-hydroxytryptamine receptor 1A
Name:5-hydroxytryptamine receptor 1A
Type:G Protein-Coupled Receptor (GPCR)
Mol. Mass.:46445.29
Organism:Rattus norvegicus (rat)
Description:Binding assays were performed using rat hippocampal membranes.
Residue:422
BDBM50117139
NameBDBM50117139
Synonyms:6-(1H-benzo[d]imidazol-1-yl)-2-(5-(4-(2-chlorophenyl)piperazin-1-yl)pentyl)pyridazin-3(2H)-one CHEMBL331867
TypeSmall organic molecule
Emp. Form.C26H29ClN6O
Mol. Mass.477.001
SMILESClc1ccccc1N1CCN(CCCCCn2nc(ccc2=O)-n2cnc3ccccc23)CC1