Reaction Details
TargetDelta-type opioid receptor
LigandBDBM50117261
Substrate/Competitorn/a
Meas. Tech.ChEMBL_145612 (CHEMBL754332)
Ki 2±n/a nM
Citation Rew, YMalkmus, SSvensson, CYaksh, TLChung, NNSchiller, PWCassel, JADeHaven, RNTaulane, JPGoodman, M Synthesis and biological activities of cyclic lanthionine enkephalin analogues: delta-opioid receptor selective ligands. J Med Chem45:3746-54 (2002) Delta-type opioid receptor
Name:Delta-type opioid receptor
Type:G Protein-Coupled Receptor (GPCR)
Mol. Mass.:40382.98
Organism:Homo sapiens (Human)
Description:Competition binding assays were carried out using membrane preparations from transfected HN9.10 cells that constitutively expressed the delta opioid receptor.
Residue:372
BDBM50117261
NameBDBM50117261
Synonyms:12-[2-Amino-3-(4-hydroxy-phenyl)-propionylamino]-6-benzyl-5,8,11-trioxo-1-thia-4,7,10-triaza-cyclotridecane-3-carboxylic acid | CHEMBL122321
TypeSmall organic molecule
Emp. Form.C26H31N5O7S
Mol. Mass.557.619
SMILESN[C@@H](Cc1ccc(O)cc1)C(=O)N[C@@H]1CSC[C@@H](NC(=O)[C@H](Cc2ccccc2)NC(=O)CNC1=O)C(O)=O