Reaction Details
TargetKappa-type opioid receptor
LigandBDBM50117263
Substrate/Competitorn/a
Meas. Tech.ChEMBL_145393 (CHEMBL752736)
Ki 6400±n/a nM
Citation Rew, YMalkmus, SSvensson, CYaksh, TLChung, NNSchiller, PWCassel, JADeHaven, RNTaulane, JPGoodman, M Synthesis and biological activities of cyclic lanthionine enkephalin analogues: delta-opioid receptor selective ligands. J Med Chem45:3746-54 (2002) Kappa-type opioid receptor
Name:Kappa-type opioid receptor
Type:G Protein-Coupled Receptor (GPCR)
Mol. Mass.:42648.76
Organism:Homo sapiens (Human)
Description:P41145
Residue:380
BDBM50117263
NameBDBM50117263
Synonyms:(3R,6S,12S)-12-[(S)-2-Amino-3-(4-hydroxy-phenyl)-propionylamino]-6-benzyl-5,8,11-trioxo-1-thia-4,7,10-triaza-cyclotridecane-3-carboxylic acid CHEMBL420903
TypeSmall organic molecule
Emp. Form.C26H31N5O7S
Mol. Mass.557.619
SMILESN[C@@H](Cc1ccc(O)cc1)C(=O)N[C@@H]1CSC[C@H](NC(=O)[C@H](Cc2ccccc2)NC(=O)CNC1=O)C(O)=O