Reaction Details
TargetProstaglandin E2 receptor EP3 subtype
LigandBDBM50117691
Substrate/Competitorn/a
Meas. Tech.ChEBML_158321
Ki 330±n/a nM
Citation Gallant, MCarrière, MCChateauneuf, ADenis, DGareau, YGodbout, CGreig, GJuteau, HLachance, NLacombe, PLamontagne, SMetters, KMRochette, CRuel, RSlipetz, DSawyer, NTremblay, NLabelle, M Structure-activity relationship of biaryl acylsulfonamide analogues on the human EP(3) prostanoid receptor. Bioorg Med Chem Lett12:2583-6 (2002) Prostaglandin E2 receptor EP3 subtype
Name:Prostaglandin E2 receptor EP3 subtype
Type:Enzyme
Mol. Mass.:43335.03
Organism:Homo sapiens (Human)
Description:P43115
Residue:390
BDBM50117691
NameBDBM50117691
Synonyms:CHEMBL86886 | Thiophene-2-sulfonic acid [2-(4'-phenethylsulfanylmethyl-biphenyl-2-yl)-acetyl]-amide
TypeSmall organic molecule
Emp. Form.C27H25NO3S3
Mol. Mass.507.687
SMILESO=C(Cc1ccccc1-c1ccc(CSCCc2ccccc2)cc1)NS(=O)(=O)c1cccs1