Reaction Details
TargetThymidine phosphorylase
LigandBDBM50117689
Substrate/Competitorn/a
Meas. Tech.ChEBML_158472
Ki 770±n/a nM
Citation Gallant, MCarrière, MCChateauneuf, ADenis, DGareau, YGodbout, CGreig, GJuteau, HLachance, NLacombe, PLamontagne, SMetters, KMRochette, CRuel, RSlipetz, DSawyer, NTremblay, NLabelle, M Structure-activity relationship of biaryl acylsulfonamide analogues on the human EP(3) prostanoid receptor. Bioorg Med Chem Lett12:2583-6 (2002) Thymidine phosphorylase
Name:Thymidine phosphorylase
Type:Enzyme
Mol. Mass.:49948.87
Organism:Homo sapiens (Human)
Description:The recombinant human thymidine phosphorylase (V79TP) was expressed in V79 Chinese hamster cells (Sigma, T-9319).
Residue:482
BDBM50117689
NameBDBM50117689
Synonyms:CHEMBL87371 | Thiophene-2-sulfonic acid [(E)-3-(3',4'-dichloro-biphenyl-2-yl)-acryloyl]-amide
TypeSmall organic molecule
Emp. Form.C19H13Cl2NO3S2
Mol. Mass.438.347
SMILESClc1ccc(cc1Cl)-c1ccccc1\C=C\C(=O)NS(=O)(=O)c1cccs1