Reaction Details
TargetProstaglandin E2 receptor EP3 subtype
LigandBDBM50117683
Substrate/Competitorn/a
Meas. Tech.ChEBML_158321
Ki 110±n/a nM
Citation Gallant, MCarrière, MCChateauneuf, ADenis, DGareau, YGodbout, CGreig, GJuteau, HLachance, NLacombe, PLamontagne, SMetters, KMRochette, CRuel, RSlipetz, DSawyer, NTremblay, NLabelle, M Structure-activity relationship of biaryl acylsulfonamide analogues on the human EP(3) prostanoid receptor. Bioorg Med Chem Lett12:2583-6 (2002) Prostaglandin E2 receptor EP3 subtype
Name:Prostaglandin E2 receptor EP3 subtype
Type:Enzyme
Mol. Mass.:43335.03
Organism:Homo sapiens (Human)
Description:P43115
Residue:390
BDBM50117683
NameBDBM50117683
Synonyms:CHEMBL314616 | Thiophene-2-sulfonic acid ((E)-3-{3'-[(E)-2-(7-chloro-quinolin-2-yl)-vinyl]-biphenyl-2-yl}-acryloyl)-amide
TypeSmall organic molecule
Emp. Form.C30H21ClN2O3S2
Mol. Mass.557.082
SMILESClc1ccc2ccc(\C=C\c3cccc(c3)-c3ccccc3\C=C\C(=O)NS(=O)(=O)c3cccs3)nc2c1