Reaction Details
TargetcGMP-specific 3',5'-cyclic phosphodiesterase
LigandBDBM50117704
Substrate/Competitorn/a
Meas. Tech.ChEBML_155212
IC50 28±n/a nM
Citation Arnold, RBeer, DBhalay, GBaettig, UCollingwood, SPCraig, SDevereux, NDunstan, AGlen, AGomez, SHaberthuer, SHowe, TJelfs, SMoser, HNaef, RNicklin, PSandham, DStringer, RTurner, KWatson, SZurini, M 8-Aryl xanthines potent inhibitors of phosphodiesterase 5. Bioorg Med Chem Lett12:2587-90 (2002) cGMP-specific 3',5'-cyclic phosphodiesterase
Name:cGMP-specific 3',5'-cyclic phosphodiesterase
Type:Protein
Mol. Mass.:99975.83
Organism:Homo sapiens (Human)
Description:O76074
Residue:875
BDBM50117704
NameBDBM50117704
Synonyms:3-Cyclopropylmethyl-8-[2-ethoxy-5-(4-methyl-piperazine-1-sulfonyl)-phenyl]-1-methyl-3,7-dihydro-purine-2,6-dione | CHEMBL87304
TypeSmall organic molecule
Emp. Form.C23H30N6O5S
Mol. Mass.502.587
SMILESCCOc1ccc(cc1-c1nc2n(CC3CC3)c(=O)n(C)c(=O)c2[nH]1)S(=O)(=O)N1CCN(C)CC1