Reaction Details
TargetcGMP-specific 3',5'-cyclic phosphodiesterase
LigandBDBM50117736
Substrate/Competitorn/a
Meas. Tech.ChEBML_155212
IC50 19±n/a nM
Citation Arnold, RBeer, DBhalay, GBaettig, UCollingwood, SPCraig, SDevereux, NDunstan, AGlen, AGomez, SHaberthuer, SHowe, TJelfs, SMoser, HNaef, RNicklin, PSandham, DStringer, RTurner, KWatson, SZurini, M 8-Aryl xanthines potent inhibitors of phosphodiesterase 5. Bioorg Med Chem Lett12:2587-90 (2002) cGMP-specific 3',5'-cyclic phosphodiesterase
Name:cGMP-specific 3',5'-cyclic phosphodiesterase
Type:Protein
Mol. Mass.:99975.83
Organism:Homo sapiens (Human)
Description:O76074
Residue:875
BDBM50117736
NameBDBM50117736
Synonyms:8-{2-Ethoxy-5-[4-(2-hydroxy-ethyl)-piperazine-1-sulfonyl]-phenyl}-3-isobutyl-1-methyl-3,7-dihydro-purine-2,6-dione | CHEMBL314891
TypeSmall organic molecule
Emp. Form.C24H34N6O6S
Mol. Mass.534.628
SMILESCCOc1ccc(cc1-c1nc2n(CC(C)C)c(=O)n(C)c(=O)c2[nH]1)S(=O)(=O)N1CCN(CCO)CC1