Reaction Details
TargetP04972/P11541/P16586/P22571/P23439/Q95142
LigandBDBM50117721
Substrate/Competitorn/a
Meas. Tech.ChEMBL_155385 (CHEMBL760838)
IC50 3±n/a nM
Citation Arnold, RBeer, DBhalay, GBaettig, UCollingwood, SPCraig, SDevereux, NDunstan, AGlen, AGomez, SHaberthuer, SHowe, TJelfs, SMoser, HNaef, RNicklin, PSandham, DStringer, RTurner, KWatson, SZurini, M 8-Aryl xanthines potent inhibitors of phosphodiesterase 5. Bioorg Med Chem Lett12:2587-90 (2002) P04972/P11541/P16586/P22571/P23439/Q95142
Name:P04972/P11541/P16586/P22571/P23439/Q95142
Synonyms:Phosphodiesterase 6
Type:n/a
Mol. Mass.:n/a
Description:ASSAY_ID of ChEMBL is 155381
Components:This complex has 6 components.
Component 1
Name:Retinal rod rhodopsin-sensitive cGMP 3',5'-cyclic phosphodiesterase subunit gamma
Type:PROTEIN
Mol. Mass.:9674.16
Organism:Bos taurus
Description:ChEMBL_104859
Residue:87
Component 2
Name:Cone cGMP-specific 3',5'-cyclic phosphodiesterase subunit alpha'
Synonyms:PDE V-C1 PDE6C_BOVIN cGMP phosphodiesterase 6C
Type:PROTEIN
Mol. Mass.:98783.85
Organism:Bos taurus
Description:ChEMBL_104859
Residue:855
Component 3
Name:Rod cGMP-specific 3',5'-cyclic phosphodiesterase subunit alpha
Synonyms:PDE6A PDEA Phosphodiesterase 6A
Type:Enzyme
Mol. Mass.:99320.22
Organism:Bos taurus (Bovine)
Description:P11541
Residue:859
Component 4
Name:Retinal cone rhodopsin-sensitive cGMP 3',5'-cyclic phosphodiesterase subunit gamma
Synonyms:CNCG_BOVIN PDE6H
Type:PROTEIN
Mol. Mass.:9106.39
Organism:Bos taurus
Description:ChEMBL_104859
Residue:83
Component 5
Name:Retinal rod rhodopsin-sensitive cGMP 3',5'-cyclic phosphodiesterase subunit delta
Synonyms:GMP-PDE delta PDE6D_BOVIN
Type:PROTEIN
Mol. Mass.:17388.28
Organism:Bos taurus
Description:ChEMBL_104859
Residue:150
Component 6
Name:Rod cGMP-specific 3',5'-cyclic phosphodiesterase subunit beta
Synonyms:GMP-PDE beta PDE6B_BOVIN | PDEB
Type:PROTEIN
Mol. Mass.:98307.54
Organism:Bos taurus
Description:ChEMBL_104859
Residue:853
BDBM50117721
NameBDBM50117721
Synonyms:3-Isobutyl-1-methyl-8-[5-(piperazin-1-ylmethanesulfonyl)-2-propoxy-phenyl]-3,7-dihydro-purine-2,6-dione | CHEMBL315477
TypeSmall organic molecule
Emp. Form.C25H36N6O5S
Mol. Mass.532.656
SMILESCCCOc1ccc(cc1-c1nc2n(CC(C)C)c(=O)n(C)c(=O)c2[nH]1)S(=O)(=O)N1CCN(CC)CC1