Reaction Details
TargetPlatelet-activating factor acetylhydrolase
LigandBDBM50117775
Substrate/Competitorn/a
Meas. Tech.ChEBML_156373
IC50 0.200000±n/a nM
Citation Blackie, JABloomer, JCBrown, MJCheng, HYElliott, RLHammond, BHickey, DMIfe, RJLeach, CALewis, VAMacphee, CHMilliner, KJMoores, KEPinto, ILSmith, SAStansfield, IGStanway, SJTaylor, MATheobald, CJWhittaker, CM The discovery of SB-435495. A potent, orally active inhibitor of lipoprotein-associated phospholipase A(2) for evaluation in man. Bioorg Med Chem Lett12:2603-6 (2002) Platelet-activating factor acetylhydrolase
Name:Platelet-activating factor acetylhydrolase
Type:PROTEIN
Mol. Mass.:50084.41
Organism:Homo sapiens (Human)
Description:ChEMBL_156212
Residue:441
BDBM50117775
NameBDBM50117775
Synonyms:CHEMBL84894 | N-(4'-Chloro-biphenyl-4-ylmethyl)-N-dimethylcarbamoylmethyl-2-[2-(4-fluoro-benzylsulfanyl)-5-(2-methoxy-pyrimidin-5-ylmethyl)-4-oxo-4H-pyrimidin-1-yl]-acetamide
TypeSmall organic molecule
Emp. Form.C36H34ClFN6O4S
Mol. Mass.701.209
SMILESCOc1ncc(Cc2cn(CC(=O)N(CC(=O)N(C)C)Cc3ccc(cc3)-c3ccc(Cl)cc3)c(SCc3ccc(F)cc3)nc2=O)cn1