Reaction Details
TargetType-1 angiotensin II receptor
LigandBDBM50091105
Substrate/Competitorn/a
Meas. Tech.ChEMBL_36920 (CHEMBL647120)
Ki>0.000100±n/a nM
Citation Murugesan, NTellew, JEGu, ZKunst, BLFadnis, LCornelius, LABaska, RAYang, YBeyer, SMMonshizadegan, HDickinson, KEPanchal, BValentine, MTChong, SMorrison, RACarlson, KEPowell, JRMoreland, SBarrish, JCKowala, MCMacor, JE Discovery of N-isoxazolyl biphenylsulfonamides as potent dual angiotensin II and endothelin A receptor antagonists. J Med Chem45:3829-35 (2002) Type-1 angiotensin II receptor
Name:Type-1 angiotensin II receptor
Type:Protein
Mol. Mass.:41080.75
Organism:Homo sapiens (Human)
Description:P30556
Residue:359
BDBM50091105
NameBDBM50091105
Synonyms:4''-Oxazol-2-yl-biphenyl-2-sulfonic acid (3,4-dimethyl-isoxazol-5-yl)-amide 4'-Oxazol-2-yl-biphenyl-2-sulfonicacid(3,4-dimethyl-isoxazol-5-yl)-amide CHEMBL24461
TypeSmall organic molecule
Emp. Form.C20H17N3O4S
Mol. Mass.395.432
SMILESCc1noc(NS(=O)(=O)c2ccccc2-c2ccc(cc2)-c2ncco2)c1C